{"text_format":"1","workbook":"xlsx","n_sheets":4,"sheets":["リスト","財源","雇用調書","リストマスタ"],"not_rendered":{"charts":0,"images":0,"macros":1,"external_links":0,"defined_names":30,"comments":0,"pivot_tables":0},"unopened":[],"bounds":{"document_bytes":16777216,"sheet_cells":100000,"rows_first":2000,"rows_last":500,"rows_between":2000,"halvings":0,"cell_chars":16384,"cell_head_chars":4096},"cells_cut":0,"cells_raw":0,"read":"whole","date_system":"1900"}

{"sheet":"リスト","index":0,"n_rows":14,"n_cols":81,"rows_kept":14,"cut":false,"hidden":false,"merged":[]}
[null,2,3,4,5,6,7,8,9,10,11,12,13,14,15,16,17,18,19,20,21,22,23,24,25,26,27,28,29,30,31,32,33,34,35,36,37,38,39,40,41,42,43,44,45,46,47,48,49,50,51,52,53,54,55,56,57,58,59,60,61,62,63,64,65,66,67,68,69,70,71,72,73,74,75,76,77,78,79,80,81]
["管理番号","新職番","旧職番","所属ｺｰﾄﾞ","所属","(所属担当）","氏　　名","ｶﾅ","旧姓使用者の本姓","性別","生年月日","年齢","区分","職種","職種区分","（現：職種）","研究職区分","職種（特別単価者）","新規・継続・退職","昨年度","契約期間（始）","契約期間（終）","更新上限の有無","更新上限（日付）","更新上限の備考","退職年月日","就業場所","勤務場所","従事業務内容","契約書への定型文","勤務時間","勤務時間数","週勤務日数","週勤務時間","休憩時間","勤務曜日","休日区分","休日","給料"," 単価１ ","（現：単価）","保険加入注意事項","社保区分","雇保区分","健康\n保険","介護\n保険","厚生\n年金","雇用\n保険","労災\n保険","年休","年休付与日","採用年月日","過去の契約","雇用財源","人件費番号","紙出勤簿","人給システム","国籍","在留資格","在留期限","資格外活動許可書","変更番号","備考（変更内容など）","変更後\n社保","変更後\n雇用","同一人物","交通費（号）","担当者","安否確認","本人住所\n郵便番号","市町村","町名","番地以降（全角）","住所結合","雇用契約変更履歴","財源変更履歴","決裁簿名\n（4月限定）","雇用手続き日（※COMPANY上の\n項目「勤続滞留基準日」）","本人連絡先","備考","調書様式"]
["↓セルA4\r\nダブルクリック\r\nで氏名が入力されている最終行まで再付番＆関数抜け復元",null,null,null,null,"教育推進課及び学術情報課のみ入力",null,null,"苗字（フリガナ）","男性：1\n女性：2","西暦（1900/12/31）入力\n（1900.12.31に変換）","↓基準日入力","フルタイム（特定有期）\nパートタイム（短時間・臨時）","区分（M列）入力後に選択",null,"参考情報",null,null,null,null,"西暦（1900/12/31）入力\n（1900.12.31に変換）","西暦（1900/12/31）入力\n（1900.12.31に変換）","契約に更新上限を\n　設定する　　→　有\n　設定しない　→　無","更新上限の設定で「有」を選択した場合は、日付を入力してください。\n西暦（1900/12/31）入力",null,null,null,"キャンパス内の従事場所","契約書に業務内容を記載したい場合は入力\n（記載しなければ職種によって定型文が記載される）","雇用契約書の業務内容欄に\n「その他大学運営業務」を記載しない場合のみ選択\n\n※研究系の職種の場合は、選択内容に関わらず記載されない","裁量労働制：「裁量」\n時間帯が固定：　「0:00～24:00」の形式\nシフト勤務：「シフト勤務」","１日の実勤務時間数を数値で入力\n（7：45なら「7.75」）\nシフト勤務の場合は「シフト勤務」\n曜日によって異なる場合は「（月・水・金）4、（火・木）5」）","雇用期間が１日の場合は「－」","月〇日など計算できる場合は（月勤務時間×12÷52）で計算して入力","裁量労働制：「裁量」\n休憩時間帯が固定：　「0:00～24:00」の形式\nシフト勤務：「シフト勤務」\n休憩がない場合：「なし」","週勤務日数（Z列）入力後に選択\n前期・後期で異なる場合など、選択肢にない場合は自由入力","0：土、日、祝日、年末年始\n1：0以外の場合","＜例＞\n　月～金固定の場合：土、日、国民の祝日に関する法律に基づく休日、12月29日～1月3日\n　シフトの場合：勤務日以外　　など","（個別）の場合は以下のいずれかを直接入力\n\n・年俸\n・月給\n・日給\n・時給\n・コマ","（個別決定）の場合は直接入力","参考情報","週30時間未満で社保加入者は【週30時間未満】と入力\n（選択後、追記可能）","複数職番を有する場合など、合算することで加入となる場合は変更が必要","複数職番を有する場合など、合算することで加入となる場合は変更が必要","７５歳未満","４０歳\n以上\n６５歳\n未満","７０歳\n未満","６５歳\n未満",null,"契約書に日数もしくは文言が記載される","シフト勤務：採用日から半年後\nそれ以外：「4月1日」\n\n※変更の場合は直接入力\n※本務教職員の定年退職後の再雇用は6月1日の場合有","年休計算シートではCA列の「雇用手続日」を使用する",null,"人事課人件費\n　⇒「○」\nその他予算\n　⇒「－」","人事課人件費の場合のみ入力","【出勤簿区分】  \n①：勤務日、時間固定\n①（時間シフト制）：勤務日、実勤務時間固定\n①フルタイム：特定有期教員・研究員\n②：シフト勤務\n③：限定職種（情報推進MS,SS、\n　文交C学生アルバイト、共通教育実習補助）\n学部様式：白馬管理人　シフト勤務専用\n","○：ICカード発行\n●：ICカード未発行\n★：管理区分（教員）\n\n・　ICカードが必要：〇（特定の職種かつ週30時間以上勤務で曜日ごとの勤務時間が決まっている）\n・　特定有期の特任教員（人事課の人件費で研究科に所属）：★\n・　特定有期の特任教員（外部資金）は紙出勤簿","日本国\n特別永住者\n中華人民共和国\n大韓民国・・・etc","外国籍で特別永住者でない場合は入力","外国籍で特別永住者でない場合は入力","外国籍で特別永住者でない場合は選択","１．職員番号変更\n２．社保・雇保変更　３．その他\n４．退職","入力後、変更履歴欄にも、変更月・変更内容を入力のこと","加入する\n　⇒「○」\n加入しない\n　⇒「×」","加入する\n　⇒「○」\n加入しない\n　⇒「×」","当月シート内の氏名ｶﾅ欄で判定。\n同一人物が2名以上の場合\n①合算して所定勤務時間など\n　上限を超えてないか\n②保険合算して加入あるか\n③職種の通算（採用日の引継ぎ）\n　があるか要確認","特定有期：本務・特定有期\nパートタイム＆週所定4日以上： 1号通勤手当 \nパートタイム＆週所定3日以下orシフト：3号通勤手当\n臨時：3号通勤手当\nパートタイム＆職種（特命・法曹・日本語補講) ：5号通勤手当\nパートタイム＆職種（ﾘｻｰﾁｱｼｽﾀﾝﾄ）：支給なし","所属　名前\n（人事課　○○）","臨時雇用以外は「要」","「000-0000」の\n形式で入力","区まである場合：\n　○○市○○区まで\n区がない場合：\n　○○市まで\n郡の場合：\n　○○郡○○町まで\n",null,"数字、記号はすべて全角。スペースも全角。",null,null,null,"４月のみ使用\n決裁簿の項目名を記載","年休計算の基準日","内線４桁　又は\n携帯番号等"]
["Double Click","入力","入力","自動","選択","入力","入力","入力","入力","選択","入力","2022-04-01","選択","選択",null,null,"自動","入力","選択","入力","入力","入力","選択","入力","入力","入力","選択","入力","入力","選択","選択/入力","入力","選択","自動/入力","選択/入力","選択","自動","選択/入力","自動/入力","自動/入力",null,"選択/入力","自動/入力","自動/入力","自動","自動","自動","自動","自動","入力","自動","入力","入力","選択","入力","入力","選択","入力","入力","入力","選択","選択","入力","選択","選択","自動","自動","入力","自動","入力","自動","自動","入力","自動","入力","入力","入力","入力","入力","入力","自動"]
["例",1234567,null,{"$f":"VLOOKUP(E5,リストマスタ!$C:$D,2,0)","v":103020},"人事課",null,"市大　太郎","ｼﾀﾞｲ ﾀﾛｳ",null,1,"1990-04-01",{"$f":"DATEDIF(K5,($L$4),\"Y\")","v":32},"パートタイム","研究員","A",null,{"$f":"IF(VLOOKUP(N5,IF(M5=\"フルタイム\",リストマスタ!$L:$N,IF(M5=\"パートタイム\",リストマスタ!$O:$Q)),3,0)=\"研究職\",\"○\",\"\")","v":"○"},null,"新規",null,"2022-04-01","2023-03-31","有","2024-03-31",null,null,"杉本キャンパス","人事課",null,null,"9：00～17：15",7.5,5,{"$f":"IF(AND(ISNUMBER(AF5),ISNUMBER(AG5)),AF5*AG5,IF(AND(ISNUMBER(AF5),COUNTIF(AG5,\"月*日\")),ROUND(AF5*VALUE(SUBSTITUTE(SUBSTITUTE(AG5,\"月\",\"\"),\"日\",\"\"))*12/52,2),\"\"))","v":37.5},"12:00～12:45","月、火、水、木、金",{"$f":"IF($AJ5=\"月、火、水、木、金\",1,0)","v":1},"土、日、国民の祝日に関する法律に基づく休日、12月29日～1月3日",{"$f":"VLOOKUP(N5&O5,IF(M5=\"フルタイム\",リストマスタ!$F:$H,IF(M5=\"パートタイム\",リストマスタ!$I:$K)),2,0)","v":"時給"},{"$f":"VLOOKUP(N5&O5,IF(M5=\"フルタイム\",リストマスタ!$F:$H,IF(M5=\"パートタイム\",リストマスタ!$I:$K)),3,0)","v":1700},null,null,{"$f":"IF(L5>=75,\"非加入\",IF(M5=\"フルタイム\",\"フルタイム\",IF(AND(DATEDIF(U5,V5+1,\"m\")>=2,AH5>=30),\"加入（主）\",IF(AND(DATEDIF(U5,V5+1,\"y\")>=1,AH5>=20,AH5*52/12*AN5>=88000),\"加入（主）\",\"非加入\"))))","v":"加入（主）"},{"$f":"IF(M5=\"フルタイム\",\"フルタイム\",IF(AND(ISNUMBER(AH5),DATEDIF(U5,V5+1,\"d\")>=31,AH5>=20),\"加入\",\"非加入\"))","v":"加入"},{"$f":"IF(OR(AQ5=\"フルタイム\",AQ5=\"加入（主）\",AQ5=\"加入（副）\"),\"有\",\"―\")","v":"有"},{"$f":"IF(AND(AS5=\"有\",L5>=40,L5<65),\"有\",\"―\")","v":"―"},{"$f":"IF(AND(AS5=\"有\",L5<70),\"有\",\"―\")","v":"有"},{"$f":"IF(OR(AR5=\"フルタイム\",AR5=\"加入\",AR5=\"加入/合算対象有\"),\"有\",\"―\")","v":"有"},{"$f":"IF(COUNTA(AQ5:AR5)=2,\"有\",\"\")","v":"有"},10,{"$f":"IF(M5=\"臨時\",\"4月1日\",IF(AI5=\"シフト勤務\",DATE(,MONTH(U5)+6,DAY(U5)),IF(M5=\"再雇用\",\"6月1日\",\"4月1日\")))","v":"4月1日"},"2019-10-01",null,"○","H11111","①",null,"日本国",null,null,null,null,null,"○","○",{"$f":"COUNTIF($H:$H,H5)","v":1},{"$f":"IF(M5=\"フルタイム\",\"フルタイム\",IF(AG5=\"シフト勤務\",\"2号通勤手当\",IF(AND(M5=\"パートタイム\",OR(N5=\"特命教授\",N5=\"特命准教授\",N5=\"法曹実務教員\",N5=\"日本語補講講師\")),\"3号通勤手当\",IF(AND(M5=\"パートタイム\",N5=\"ﾘｻｰﾁｱｼｽﾀﾝﾄ\"),\"支給なし\",IF(ISNUMBER(AG5),IF(AND(M5=\"パートタイム\",AG5>=4),\"1号通勤手当\",\"2号通勤手当\"),IF(AND(M5=\"パートタイム\",OR(AG5=\"4～5\",AG5=\"5～6\",AG5=\"月16日\",AG5=\"月17日\",AG5=\"月18日\",AG5=\"月19日\",AG5=\"月20日\",AG5=\"月21日\")),\"1号通勤手当\",IF(M5=\"パートタイム\",\"2号通勤手当\",\"判定エラー\")))))))","v":"1号通勤手当"},"人事課　山田",{"$f":"IF(M5=\"臨時\",\"\",\"要\")","v":"要"},"558-8585","大阪市住吉区","杉本","３－３－１３８",{"$f":"BS5&BT5&BU5","v":"大阪市住吉区杉本３－３－１３８"},null,null,null,null,9999,null,{"$f":"IF(U5=V5,6,IF(AF5=\"シフト勤務\",5,IF(ISNUMBER(AF5),IF(OR(AJ5=\"シフト勤務\",COUNTIF(AJ5,\"週*日\")=1,COUNTIF(AJ5,\"月*日\")=1),2,1),IF(OR(AJ5=\"シフト勤務\",COUNTIF(AJ5,\"週*日\")=1,COUNTIF(AJ5,\"月*日\")=1),4,3))))","v":1}]
[null,null,null,{"$f":"VLOOKUP(E6,リストマスタ!$C:$D,2,0)","v":{"$error":"#N/A"}},null,null,null,null,null,null,null,{"$f":"DATEDIF(K6,($L$4),\"Y\")","v":122},null,null,null,null,{"$f":"IF(VLOOKUP(N6,IF(M6=\"フルタイム\",リストマスタ!$L:$N,IF(M6=\"パートタイム\",リストマスタ!$O:$Q)),3,0)=\"研究職\",\"○\",\"\")","v":{"$error":"#N/A"}},null,null,null,null,null,null,null,null,null,null,null,null,null,null,null,null,{"$f":"IF(AND(ISNUMBER(AF6),ISNUMBER(AG6)),AF6*AG6,IF(AND(ISNUMBER(AF6),COUNTIF(AG6,\"月*日\")),ROUND(AF6*VALUE(SUBSTITUTE(SUBSTITUTE(AG6,\"月\",\"\"),\"日\",\"\"))*12/52,2),\"\"))","v":""},null,null,{"$f":"IF($AJ6=\"月、火、水、木、金\",1,0)","v":0},null,{"$f":"VLOOKUP(N6&O6,IF(M6=\"フルタイム\",リストマスタ!$F:$H,IF(M6=\"パートタイム\",リストマスタ!$I:$K)),2,0)","v":{"$error":"#N/A"}},{"$f":"VLOOKUP(N6&O6,IF(M6=\"フルタイム\",リストマスタ!$F:$H,IF(M6=\"パートタイム\",リストマスタ!$I:$K)),3,0)","v":{"$error":"#N/A"}},null,null,{"$f":"IF(L6>=75,\"非加入\",IF(M6=\"フルタイム\",\"フルタイム\",IF(AND(DATEDIF(U6,V6+1,\"m\")>=2,AH6>=30),\"加入（主）\",IF(AND(DATEDIF(U6,V6+1,\"y\")>=1,AH6>=20,AH6*52/12*AN6>=88000),\"加入（主）\",\"非加入\"))))","v":"非加入"},{"$f":"IF(M6=\"フルタイム\",\"フルタイム\",IF(AND(ISNUMBER(AH6),DATEDIF(U6,V6+1,\"d\")>=31,AH6>=20),\"加入\",\"非加入\"))","v":"非加入"},{"$f":"IF(OR(AQ6=\"フルタイム\",AQ6=\"加入（主）\",AQ6=\"加入（副）\"),\"有\",\"―\")","v":"―"},{"$f":"IF(AND(AS6=\"有\",L6>=40,L6<65),\"有\",\"―\")","v":"―"},{"$f":"IF(AND(AS6=\"有\",L6<70),\"有\",\"―\")","v":"―"},{"$f":"IF(OR(AR6=\"フルタイム\",AR6=\"加入\",AR6=\"加入/合算対象有\"),\"有\",\"―\")","v":"―"},{"$f":"IF(COUNTA(AQ6:AR6)=2,\"有\",\"\")","v":"有"},null,{"$f":"IF(M6=\"臨時\",\"4月1日\",IF(AI6=\"シフト勤務\",DATE(,MONTH(U6)+6,DAY(U6)),IF(M6=\"再雇用\",\"6月1日\",\"4月1日\")))","v":"4月1日"},null,null,null,null,null,null,null,null,null,null,null,null,null,null,0,{"$f":"IF(M6=\"フルタイム\",\"フルタイム\",IF(AG6=\"シフト勤務\",\"2号通勤手当\",IF(AND(M6=\"パートタイム\",OR(N6=\"特命教授\",N6=\"特命准教授\",N6=\"法曹実務教員\",N6=\"日本語補講講師\")),\"3号通勤手当\",IF(AND(M6=\"パートタイム\",N6=\"ﾘｻｰﾁｱｼｽﾀﾝﾄ\"),\"支給なし\",IF(ISNUMBER(AG6),IF(AND(M6=\"パートタイム\",AG6>=4),\"1号通勤手当\",\"2号通勤手当\"),IF(AND(M6=\"パートタイム\",OR(AG6=\"4～5\",AG6=\"5～6\",AG6=\"月16日\",AG6=\"月17日\",AG6=\"月18日\",AG6=\"月19日\",AG6=\"月20日\",AG6=\"月21日\")),\"1号通勤手当\",IF(M6=\"パートタイム\",\"2号通勤手当\",\"判定エラー\")))))))","v":"判定エラー"},null,{"$f":"IF(M6=\"臨時\",\"\",\"要\")","v":"要"},null,null,null,null,{"$f":"BS6&BT6&BU6","v":""},null,null,null,null,null,null,{"$f":"IF(U6=V6,6,IF(AF6=\"シフト勤務\",5,IF(ISNUMBER(AF6),IF(OR(AJ6=\"シフト勤務\",COUNTIF(AJ6,\"週*日\")=1,COUNTIF(AJ6,\"月*日\")=1),2,1),IF(OR(AJ6=\"シフト勤務\",COUNTIF(AJ6,\"週*日\")=1,COUNTIF(AJ6,\"月*日\")=1),4,3))))","v":6}]
[null,null,null,{"$f":"VLOOKUP(E7,リストマスタ!$C:$D,2,0)","v":{"$error":"#N/A"}},null,null,null,null,null,null,null,{"$f":"DATEDIF(K7,($L$4),\"Y\")","v":122},null,null,null,null,{"$f":"IF(VLOOKUP(N7,IF(M7=\"フルタイム\",リストマスタ!$L:$N,IF(M7=\"パートタイム\",リストマスタ!$O:$Q)),3,0)=\"研究職\",\"○\",\"\")","v":{"$error":"#N/A"}},null,null,null,null,null,null,null,null,null,null,null,null,null,null,null,null,"",null,null,0,null,{"$f":"VLOOKUP(N7&O7,IF(M7=\"フルタイム\",リストマスタ!$F:$H,IF(M7=\"パートタイム\",リストマスタ!$I:$K)),2,0)","v":{"$error":"#N/A"}},{"$f":"VLOOKUP(N7&O7,IF(M7=\"フルタイム\",リストマスタ!$F:$H,IF(M7=\"パートタイム\",リストマスタ!$I:$K)),3,0)","v":{"$error":"#N/A"}},null,null,"非加入","非加入","―","―","―","―","有",null,"4月1日",null,null,null,null,null,null,null,null,null,null,null,null,null,null,0,"判定エラー",null,{"$f":"IF(M7=\"臨時\",\"\",\"要\")","v":"要"},null,null,null,null,{"$f":"BS7&BT7&BU7","v":""},null,null,null,null,null,null,6]
[null,null,null,{"$f":"VLOOKUP(E8,リストマスタ!$C:$D,2,0)","v":{"$error":"#N/A"}},null,null,null,null,null,null,null,122,null,null,null,null,{"$f":"IF(VLOOKUP(N8,IF(M8=\"フルタイム\",リストマスタ!$L:$N,IF(M8=\"パートタイム\",リストマスタ!$O:$Q)),3,0)=\"研究職\",\"○\",\"\")","v":{"$error":"#N/A"}},null,null,null,null,null,null,null,null,null,null,null,null,null,null,null,null,"",null,null,0,null,{"$f":"VLOOKUP(N8&O8,IF(M8=\"フルタイム\",リストマスタ!$F:$H,IF(M8=\"パートタイム\",リストマスタ!$I:$K)),2,0)","v":{"$error":"#N/A"}},{"$f":"VLOOKUP(N8&O8,IF(M8=\"フルタイム\",リストマスタ!$F:$H,IF(M8=\"パートタイム\",リストマスタ!$I:$K)),3,0)","v":{"$error":"#N/A"}},null,null,"非加入","非加入","―","―","―","―","有",null,"4月1日",null,null,null,null,null,null,null,null,null,null,null,null,null,null,0,"判定エラー",null,"要",null,null,null,null,"",null,null,null,null,null,null,6]
[null,null,null,{"$f":"VLOOKUP(E9,リストマスタ!$C:$D,2,0)","v":{"$error":"#N/A"}},null,null,null,null,null,null,null,122,null,null,null,null,{"$f":"IF(VLOOKUP(N9,IF(M9=\"フルタイム\",リストマスタ!$L:$N,IF(M9=\"パートタイム\",リストマスタ!$O:$Q)),3,0)=\"研究職\",\"○\",\"\")","v":{"$error":"#N/A"}},null,null,null,null,null,null,null,null,null,null,null,null,null,null,null,null,"",null,null,0,null,{"$f":"VLOOKUP(N9&O9,IF(M9=\"フルタイム\",リストマスタ!$F:$H,IF(M9=\"パートタイム\",リストマスタ!$I:$K)),2,0)","v":{"$error":"#N/A"}},{"$f":"VLOOKUP(N9&O9,IF(M9=\"フルタイム\",リストマスタ!$F:$H,IF(M9=\"パートタイム\",リストマスタ!$I:$K)),3,0)","v":{"$error":"#N/A"}},null,null,"非加入","非加入","―","―","―","―","有",null,"4月1日",null,null,null,null,null,null,null,null,null,null,null,null,null,null,0,"判定エラー",null,"要",null,null,null,null,"",null,null,null,null,null,null,6]
[null,null,null,{"$f":"VLOOKUP(E10,リストマスタ!$C:$D,2,0)","v":{"$error":"#N/A"}},null,null,null,null,null,null,null,122,null,null,null,null,{"$f":"IF(VLOOKUP(N10,IF(M10=\"フルタイム\",リストマスタ!$L:$N,IF(M10=\"パートタイム\",リストマスタ!$O:$Q)),3,0)=\"研究職\",\"○\",\"\")","v":{"$error":"#N/A"}},null,null,null,null,null,null,null,null,null,null,null,null,null,null,null,null,"",null,null,0,null,{"$f":"VLOOKUP(N10&O10,IF(M10=\"フルタイム\",リストマスタ!$F:$H,IF(M10=\"パートタイム\",リストマスタ!$I:$K)),2,0)","v":{"$error":"#N/A"}},{"$f":"VLOOKUP(N10&O10,IF(M10=\"フルタイム\",リストマスタ!$F:$H,IF(M10=\"パートタイム\",リストマスタ!$I:$K)),3,0)","v":{"$error":"#N/A"}},null,null,"非加入","非加入","―","―","―","―","有",null,"4月1日",null,null,null,null,null,null,null,null,null,null,null,null,null,null,0,"判定エラー",null,"要",null,null,null,null,"",null,null,null,null,null,null,6]
{"$rows_left_out":5}
{"sheet":"財源","index":1,"n_rows":57,"n_cols":60,"rows_kept":57,"cut":false,"hidden":false,"merged":[[1,20,1,21],[0,0,2,0],[1,15,1,18],[1,19,2,19],[1,3,1,4],[1,5,1,6],[1,13,1,14],[1,11,1,12],[1,9,1,10],[1,7,1,8],[56,0,56,2],[1,41,1,42],[1,43,1,44],[1,45,1,46],[1,47,1,48],[1,22,1,23],[1,24,1,25],[1,26,1,27],[1,28,1,29],[1,30,1,31],[1,32,1,33],[1,34,1,37],[0,2,2,2],[1,38,2,38],[0,1,2,1],[0,3,0,21],[1,39,1,40],[1,58,1,59],[0,41,0,59],[0,22,0,40],[1,57,2,57],[1,49,1,50],[1,51,1,52],[1,53,1,56]]}
["管理番号","所属","氏名","財務会計項目①",null,null,null,null,null,null,null,null,null,null,null,null,null,null,null,null,null,null,"財務会計項目②（複数財源の場合のみ入力）",null,null,null,null,null,null,null,null,null,null,null,null,null,null,null,null,null,null,"財務会計項目③（複数財源の場合のみ入力）"]
[null,null,null,"所管（予算）",null,"所管（執行）",null,"財源",null,"部門",null,"目的(予算)",null,"目的(執行)",null,"プロジェクト※PJコードの記入間違いにご注意ください。",null,null,null,"執行見込総額","対象期間",null,"所管（予算）",null,"所管（執行）",null,"財源",null,"部門",null,"目的(予算)",null,"目的(執行)",null,"プロジェクト※PJコードの記入間違いにご注意ください。",null,null,null,"執行見込総額","対象期間",null,"所管（予算）",null,"所管（執行）",null,"財源",null,"部門",null,"目的(予算)",null,"目的(執行)",null,"プロジェクト※PJコードの記入間違いにご注意ください。",null,null,null,"執行見込総額","対象期間"]
[null,null,null,"コード","名称","コード","名称","コード","名称","コード","名称","コード","名称","コード","名称","コード","名称","有効期限","予算財会入金処理",null,"開始日","終了日","コード","名称","コード","名称","コード","名称","コード","名称","コード","名称","コード","名称","コード","名称","有効期限","予算財会入金処理",null,"開始日","終了日","コード","名称","コード","名称","コード","名称","コード","名称","コード","名称","コード","名称","コード","名称","有効期限","予算財会入金処理",null,"開始日","終了日"]
[null,null,null,null,null,null,null,null,null,null,null,null,null,null,null,null,null,"今年度末：「無」を入力\n上記以外：期限の月日を入力","入金済：「済」を入力\n入金未：入金予定月日を入力","人件費見積もりシートを使用して算出した金額を入力","雇用期間中に財源の変更がある場合のみ入力","雇用期間中に財源の変更がある場合のみ入力",null,null,null,null,null,null,null,null,null,null,null,null,null,null,"今年度末：「無」を入力\n上記以外：期限の月日を入力","入金済：「済」を入力\n入金未：入金予定月日を入力","人件費見積もりシートを使用して算出した金額を入力","雇用期間中に財源の変更がある場合のみ入力","雇用期間中に財源の変更がある場合のみ入力",null,null,null,null,null,null,null,null,null,null,null,null,null,null,"今年度末：「無」を入力\n上記以外：期限の月日を入力","入金済：「済」を入力\n入金未：入金予定月日を入力","人件費見積もりシートを使用して算出した金額を入力","雇用期間中に財源の変更がある場合のみ入力","雇用期間中に財源の変更がある場合のみ入力"]
["例","人事課","市大　太郎",11111,"○○プロジェクト",22222,"○○プロジェクト",33333,"補助金",44444,"市大）事務部門",55555,"補助金（支出）",55555,"補助金（支出）",66666,"○○プロジェクト","無","済",100000,"2020-04-01","2020-09-30"]
[1,{"$f":"IF(VLOOKUP(A6,リスト!$A:$BB,54,0)=\"○\",\"（入力不要）\",VLOOKUP(A6,リスト!$A:$E,5,0))","v":{"$error":"#N/A"}},{"$f":"IF(VLOOKUP(A6,リスト!$A:$BB,54,0)=\"○\",\"\",VLOOKUP(A6,リスト!$A:$G,7,0))","v":{"$error":"#N/A"}}]
[2,{"$f":"IF(VLOOKUP(A7,リスト!$A:$BB,54,0)=\"○\",\"（入力不要）\",VLOOKUP(A7,リスト!$A:$E,5,0))","v":{"$error":"#N/A"}},{"$f":"IF(VLOOKUP(A7,リスト!$A:$BB,54,0)=\"○\",\"\",VLOOKUP(A7,リスト!$A:$G,7,0))","v":{"$error":"#N/A"}}]
[3,{"$f":"IF(VLOOKUP(A8,リスト!$A:$BB,54,0)=\"○\",\"（入力不要）\",VLOOKUP(A8,リスト!$A:$E,5,0))","v":{"$error":"#N/A"}},{"$f":"IF(VLOOKUP(A8,リスト!$A:$BB,54,0)=\"○\",\"\",VLOOKUP(A8,リスト!$A:$G,7,0))","v":{"$error":"#N/A"}}]
[4,{"$f":"IF(VLOOKUP(A9,リスト!$A:$BB,54,0)=\"○\",\"（入力不要）\",VLOOKUP(A9,リスト!$A:$E,5,0))","v":{"$error":"#N/A"}},{"$f":"IF(VLOOKUP(A9,リスト!$A:$BB,54,0)=\"○\",\"\",VLOOKUP(A9,リスト!$A:$G,7,0))","v":{"$error":"#N/A"}}]
[5,{"$f":"IF(VLOOKUP(A10,リスト!$A:$BB,54,0)=\"○\",\"（入力不要）\",VLOOKUP(A10,リスト!$A:$E,5,0))","v":{"$error":"#N/A"}},{"$f":"IF(VLOOKUP(A10,リスト!$A:$BB,54,0)=\"○\",\"\",VLOOKUP(A10,リスト!$A:$G,7,0))","v":{"$error":"#N/A"}}]
{"$rows_left_out":48}
{"sheet":"雇用調書","index":2,"n_rows":75,"n_cols":29,"rows_kept":75,"cut":false,"hidden":false,"merged":[[65,1,65,3],[66,1,66,3],[67,1,67,3],[68,1,68,3],[52,1,52,3],[54,1,54,3],[51,1,51,3],[38,1,38,3],[39,1,39,3],[40,1,40,3],[41,1,41,3],[42,1,42,3],[28,0,29,0],[28,1,29,3],[32,0,42,0],[64,1,64,3],[28,4,28,6],[28,7,28,8],[28,10,28,11],[32,4,32,6],[32,7,32,11],[34,7,34,11],[39,4,42,6],[39,7,40,11],[28,13,28,14],[29,4,29,6],[29,8,29,9],[1,0,1,21],[2,0,2,3],[2,4,2,7],[2,8,2,21],[3,11,3,21],[4,0,5,0],[4,1,4,3],[4,4,4,10],[4,11,5,13],[4,14,5,21],[5,1,5,3],[5,4,5,10],[8,0,9,0],[11,0,12,0],[14,0,16,0],[14,1,16,6],[14,7,15,21],[16,8,16,21],[17,0,19,0],[17,1,19,3],[17,4,17,6],[73,3,73,5],[73,6,73,21],[72,3,72,5],[72,6,72,21],[6,1,6,3],[6,4,6,10],[6,11,6,13],[6,14,6,21],[7,1,7,3],[7,4,7,10],[7,11,7,13],[7,14,7,21],[11,15,12,17],[11,18,12,21],[12,4,12,6],[12,8,12,9],[13,1,13,6],[13,7,13,21],[8,1,9,3],[8,11,9,13],[10,1,10,14],[11,1,12,3],[11,4,11,6],[11,8,11,9],[17,7,17,21],[18,4,18,6],[18,7,18,19],[23,0,24,0],[23,1,24,3],[23,4,23,6],[23,10,23,11],[23,12,23,21],[24,4,24,6],[24,10,24,11],[24,12,24,21],[19,4,19,6],[19,7,19,13],[20,0,22,0],[20,1,22,3],[20,4,20,6],[20,7,20,21],[21,4,21,6],[21,7,21,21],[22,4,22,6],[22,7,22,21],[27,1,27,3],[27,4,27,6],[27,7,27,9],[27,11,27,12],[27,13,27,18],[25,0,26,0],[25,1,26,3],[25,4,25,6],[25,7,25,9],[26,4,26,6],[26,7,26,21],[39,12,40,21],[41,7,41,11],[42,7,42,11],[37,4,37,6],[37,7,37,11],[37,12,37,21],[38,4,38,6],[38,7,38,11],[38,12,38,21],[34,12,34,21],[35,4,35,6],[35,7,35,11],[35,12,35,21],[36,4,36,6],[36,7,36,11],[36,12,36,21],[32,12,32,21],[33,4,33,6],[33,7,33,11],[33,12,33,21],[34,4,34,6],[60,12,60,21],[61,4,61,6],[61,7,61,11],[61,12,61,21],[45,0,55,0],[45,4,45,6],[45,7,45,11],[45,12,45,21],[46,4,46,6],[46,7,46,11],[46,12,46,21],[47,4,47,6],[47,7,47,11],[47,12,47,21],[48,4,48,6],[48,7,48,11],[48,12,48,21],[60,7,60,11],[59,1,61,3],[43,22,56,35],[52,4,55,6],[52,7,53,11],[52,12,53,21],[54,7,54,11],[55,7,55,11],[56,1,56,6],[56,7,56,12],[56,14,56,21],[50,4,50,6],[50,7,50,11],[50,12,50,21],[51,4,51,6],[51,7,51,11],[51,12,51,21],[43,1,43,6],[43,7,43,12],[43,14,43,21],[49,4,49,6],[49,7,49,11],[49,12,49,21],[53,1,53,3],[55,1,55,3],[46,1,48,3],[65,4,68,6],[65,7,66,11],[65,12,66,21],[67,7,67,11],[68,7,68,11],[63,4,63,6],[63,7,63,11],[63,12,63,21],[64,4,64,6],[64,7,64,11],[64,12,64,21],[0,2,0,19],[0,20,0,21],[62,4,62,6],[62,7,62,11],[62,12,62,21],[73,0,74,2],[74,3,74,21],[71,0,71,2],[71,3,71,4],[71,5,71,6],[71,7,71,8],[72,0,72,2],[69,1,69,6],[69,7,69,12],[69,14,69,21],[58,0,68,0],[58,4,58,6],[58,7,58,11],[58,12,58,21],[59,4,59,6],[59,7,59,11],[59,12,59,21],[60,4,60,6],[33,1,35,3]]}
[null,null,"雇　用　調　書",null,null,null,null,null,null,null,null,null,null,null,null,null,null,null,null,null,{"$f":"Y2","v":1},null,null,null,null,null,"＜表示形式＞",null,"＜職員番号検索＞"]
["〔フルタイム・パートタイム〕",null,null,null,null,null,null,null,null,null,null,null,null,null,null,null,null,null,null,null,null,null,null,"管理番号",1,null,{"$f":"CHOOSE(VLOOKUP(Y2,リスト!A:CC,81,0),\"時間曜日固定\",\"時間固定・曜日不定期\",\"時間不定期・曜日固定\",\"時間曜日不定期\",\"シフト勤務\",\"単発・１日\")","v":{"$error":"#N/A"}},null,"職員番号"]
["人事課人件費番号",null,null,null,{"$f":"IF(VLOOKUP($Y$2,リスト!$A:$CC,54,0)=\"\",\"\",VLOOKUP($Y$2,リスト!$A:$CC,55,0))","v":{"$error":"#N/A"}},null,null,null,"  ※人事課人件費で雇用する場合のみ記入"]
[null,null,null,null,null,null,null,null,null,null,null,"※確認事項が発生した際に　お問合せさせて頂きます。"]
[1,"本人所属",null,null,{"$f":"IF(OR(VLOOKUP($Y$2,リスト!$A:$CC,5,0)=\"学術情報課\",VLOOKUP($Y$2,リスト!$A:$CC,5,0)=\"教育推進課\"),VLOOKUP($Y$2,リスト!$A:$CC,5,0)&VLOOKUP($Y$2,リスト!$A:$CC,6,0),VLOOKUP($Y$2,リスト!$A:$CC,5,0))","v":{"$error":"#N/A"}},null,null,null,null,null,null,"事務担当者",null,null,{"$f":"VLOOKUP($Y$2,リスト!$A:$CC,68,0)","v":{"$error":"#N/A"}}]
[null,"本人連絡先",null,null,{"$f":"IF(ISBLANK(VLOOKUP($Y$2,リスト!$A:$CC,79,0)),\"\",IF(LEN(VLOOKUP($Y$2,リスト!$A:$CC,79,0))=4,\"（内線番号） \"&VLOOKUP($Y$2,リスト!$A:$CC,79,0),VLOOKUP($Y$2,リスト!$A:$CC,79,0)))","v":{"$error":"#N/A"}},null,null,null,null,null,null,null,null,null,null,null,null,null,null,null,null,null,null,"＜管理番号指定印刷＞",null,null,"＜雇用開始日指定印刷＞"]
[2,"氏名",null,null,{"$f":"VLOOKUP($Y$2,リスト!$A:$CC,7,0)","v":{"$error":"#N/A"}},null,null,null,null,null,null,"ヨミガナ",null,null,{"$f":"VLOOKUP($Y$2,リスト!$A:$CC,8,0)","v":{"$error":"#N/A"}},null,null,null,null,null,null,null,null,"開始番号",1,null,"期間指定開始日","2019-10-01"]
[3,"職種区分",null,null,{"$f":"VLOOKUP($Y$2,リスト!$A:$CC,13,0)","v":{"$error":"#N/A"}},null,null,null,null,null,null,"職種",null,null,{"$f":"VLOOKUP($Y$2,リスト!$A:$CC,14,0)&VLOOKUP($Y$2,リスト!$A:$CC,15,0)","v":{"$error":"#N/A"}},null,null,null,null,null,null,null,null,"終了番号",101,null,"期間指定終了日","2019-10-01"]
[4,"職員番号",null,null,{"$f":"LEFT(VLOOKUP($Y$2,リスト!$A:$CC,2,0),1)","v":{"$error":"#N/A"}},{"$f":"MID(VLOOKUP($Y$2,リスト!$A:$CC,2,0),2,1)","v":{"$error":"#N/A"}},{"$f":"MID(VLOOKUP($Y$2,リスト!$A:$CC,2,0),3,1)","v":{"$error":"#N/A"}},{"$f":"MID(VLOOKUP($Y$2,リスト!$A:$CC,2,0),4,1)","v":{"$error":"#N/A"}},{"$f":"MID(VLOOKUP($Y$2,リスト!$A:$CC,2,0),5,1)","v":{"$error":"#N/A"}},{"$f":"MID(VLOOKUP($Y$2,リスト!$A:$CC,2,0),6,1)","v":{"$error":"#N/A"}},{"$f":"RIGHT(VLOOKUP($Y$2,リスト!$A:$CC,2,0),1)","v":{"$error":"#N/A"}},"※記入不要"]
[]
{"$rows_left_out":66}
{"sheet":"リストマスタ","index":3,"n_rows":67,"n_cols":27,"rows_kept":67,"cut":false,"hidden":false,"merged":[]}
[]
["【社会保険区分】",null,"【所属区分】",null,null,"【職種】",null,null,null,null,null,null,null,null,null,null,null,null,null,null,"【週勤務日数区分】"]
["フルタイム",null,"所属名","コード",null,"フルタイム（給与）",null,null,"パートタイム（給与）",null,null,"フルタイム",null,null,"パートタイム",null,null,"職種区分",null,null,1,2,3,4,5,6,"シフト勤務"]
["加入（主）",null,"監査室",102000,null,"特任研究員E","月給",316000,"特任教授S","（個別決定）","（個別決定）","特任研究員","研究業務","研究職","特任教授","教育・研究","研究職","特任教授",null,null,"週1日","週2日","週3日","週4日","週5日","週6日","シフト勤務"]
["加入（副）",null,"総務課",103010,null,"URAS","（個別決定）","（個別決定）","特任教授","時給",3600,"URA",null,"研究職","特任准教授","教育・研究","研究職","特任教授","S",null,"月","月、火","月、火、水","月、火、水、木","月、火、水、木、金","月、火、水、木、金、土"]
["非加入",null,"企画課",103012,null,"URAA","月給",568000,"特任准教授","時給",2800,"ﾌﾟﾛｼﾞｪｸﾄｺｰﾃﾞｨﾈｰﾀｰ",null,"一般職","特任講師","教育・研究","研究職","特任研究員","S",null,"火","月、水","月、火、木","月、火、水、金","月、火、水、木、土","月、火、水、木、金、日"]
[null,null,"人事課",103020,null,"URAB","月給",442000,"特任講師","時給",2400,"特任教授","教育・研究","研究職","特任助教","教育・研究","研究職","特任研究員","A",null,"水","月、木","月、火、金","月、火、水、土","月、火、水、木、日","月、火、水、木、土、日"]
[null,null,"財務課",103030,null,"URAC","月給",379000,"特任助教","時給",2100,"特任准教授","教育・研究","研究職","特任研究員","研究業務","研究職","特任研究員","B",null,"木","月、金","月、火、土","月、火、水、日","月、火、水、金、土","月、火、水、金、土、日"]
[null,null,"ステークホルダー連携推進室",103040,null,"URAD","月給",316000,"特任研究員S","（個別決定）","（個別決定）","特任講師","教育・研究","研究職","シニア研究員","研究業務","研究職","特任研究員","C",null,"金","月、土","月、火、日","月、火、木、金","月、火、水、金、日","月、火、木、金、土、日"]
["【雇用保険区分】",null,"安全衛生課",103050,null,"URAE","月給",268000,"特任研究員A","時給",3600,"特任助教","教育・研究","研究職","研究員","研究業務","研究職","特任研究員","D",null,"土","月、日","月、水、木","月、火、木、土","月、火、水、土、日","月、水、木、金、土、日"]
{"$rows_left_out":57}